{"text_format":"1","workbook":"xlsx","n_sheets":7,"sheets":["Notice technique","1. Présentation","2. Données de caractérisation","3. Données et analyse","Data des listes","Nomenclature","Dev"],"not_rendered":{"charts":0,"images":2,"macros":1,"external_links":0,"defined_names":40,"comments":0,"pivot_tables":0},"unopened":[],"bounds":{"document_bytes":16777216,"sheet_cells":100000,"rows_first":2000,"rows_last":500,"rows_between":2000,"halvings":0,"cell_chars":16384,"cell_head_chars":4096},"cells_cut":0,"cells_raw":0,"read":"whole","date_system":"1900"}

{"sheet":"Notice technique","index":0,"n_rows":47,"n_cols":3,"rows_kept":47,"cut":false,"hidden":false,"merged":[[42,1,42,18],[0,2,3,12],[11,1,11,18],[12,1,12,18],[8,1,8,18],[19,2,19,18],[37,1,37,18],[41,1,41,18],[22,2,22,18],[23,2,23,18],[25,2,25,18],[24,2,24,18]]}
[null,null,"DÉPARTEMENT D’ÉVALUATION DES FORMATIONS"]
["DEF 2e cycle","V 1.00"]
[]
[]
[]
[null,"Note d'utilisation"]
[]
[null,"Pour quelles formations ?"]
[null,"Cette trame du dossier d'autoévaluation (DAE 21) est à compléter pour toutes les formations du deuxième cycle évaluées par le Hcéres, à l'exception des diplômes en cinq ans (ENS, IEP et orthophonie) qui font l'objet d'une trame spécifique (DAE 22)."]
[]
[null,"Pourquoi cette trame du dossier d'autoévaluation ?"]
[null,"Cette trame a pour finalité de collecter, dans un même fichier, toutes les données et les analyses constitutives du dossier d'autoévaluation d'une formation en vue de son évaluation par le Hcéres en vague D."]
[null,"Ces données peuvent être de nature qualitative (données textuelles) ou quantitative (données chiffrées). Les données qualitatives sont à renseigner sous la forme d'un texte court ; les données quantitatives sont à renseigner sous forme brute (sauf indication contraire). Ces données sont aussi obligatoirement accompagnées d'un auto-positionnement et d'une analyse par l'équipe pédagogique.                                                                                                                                                                                                                                                                                          "]
[]
[]
[null,"Comment le remplir ?"]
[null,"Le mode d'emploi pratique pour renseigner la trame est le suivant : "]
[]
[null,"1. Activer le contenu à l'ouverture du fichier"]
[null,null,"À l'ouverture du fichier, il est indispensable d'accepter l'activation des macros (ou du contenu) lorsque le tableur vous y invite, sans quoi le fichier ne pourra pas fonctionner correctement."]
{"$rows_left_out":28}
{"sheet":"1. Présentation","index":1,"n_rows":906,"n_cols":6,"rows_kept":906,"cut":false,"hidden":false,"merged":[[0,1,3,4],[5,1,5,2]]}
[null,"DÉPARTEMENT D’ÉVALUATION DES FORMATIONS"]
[]
[]
[]
[]
[null,"1. Présentation de la formation"]
[]
["Code de la donnée"]
["P1",null,"Établissement",null,null,"Sélectionner un établissement dans la liste déroulante."]
["P2",null,"Code UAI",{"$f":"IF(ISERROR(VLOOKUP($D$9,Nomenclature!$A$2:$B$13,2,FALSE)),\"\",VLOOKUP($D$9,Nomenclature!$A$2:$B$13,2,FALSE))","v":""}]
["P3",null,"Intitulé de la formation",null,null,"Sélectionner un intitulé de formation dans la liste déroulante. \nCet intitulé correspond à la liste transmise par l'établissement au Hcéres le 22 juillet 2022."]
["P4",null,"Type de cursus",{"$f":"IF(ISERROR(INDEX(Nomenclature!$W$2:$W$500,MATCH(1,(Nomenclature!$T$2:$T$500=$D$9)*(Nomenclature!$U$2:$U$500=$D$11),0))),\"\",(INDEX(Nomenclature!$W$2:$W$500,MATCH(1,(Nomenclature!$T$2:$T$500=$D$9)*(Nomenclature!$U$2:$U$500=$D$11),0))))","v":0}]
["P5",null,"Composante de rattachement",null,null,"Saisir le nom de la composante (UFR, école, institut) si elle existe. Ne pas inclure le nom des structures internes (ex. département). Ne pas saisir d'autres types d'information (ex. données sur l'équipe pédagogique)."]
["P6",null,"Lieu(x) de formation (y compris parcours diplômants délocalisés)"]
["P7",null,"Numéro d'accréditation",{"$f":"IF(ISERROR(INDEX(Nomenclature!$X$2:$X$500,MATCH(1,(Nomenclature!$T$2:$T$500=$D$9)*(Nomenclature!$U$2:$U$500=$D$11),0))),\"\",(INDEX(Nomenclature!$X$2:$X$500,MATCH(1,(Nomenclature!$T$2:$T$500=$D$9)*(Nomenclature!$U$2:$U$500=$D$11),0))))","v":0}]
["P8",null,"Responsable(s) de la formation",null,null,"Indiquer le nom du ou des responsable(s) du diplôme (mention)                               "]
["P9",null,"Nombre de parcours diplômants de la formation",null,null,"Indiquer le nombre de parcours diplômants. Si le nombre est supérieur ou égal à 2, il correspondra aux lignes qui seront ajoutées automatiquement dans les données déclinées par parcours diplômant (marquées d'un astérisque). Cette opération peut prendre quelques instants voire plus, notamment lorsque le nombre de parcours est important. Si vous modifiez le nombre de parcours en augmentant la valeur déjà saisie, des lignes supplémentaires seront ajoutées dans l’ensemble des onglets. \nEn revanche, il n’est pas possible de modifier le nombre de parcours à la baisse pour éviter toute perte d’informations dans le DAE ; il vous faudra dans ce cas recommencer la saisie.\nPour les formations ayant un portail commun à plusieurs mentions et/ou un tronc commun à plusieurs parcours diplômants au sein d'une même mention (ex. L1 commune), compter le portail ou le tronc commun comme un parcours diplômant dans le calcul du nombre de parcours diplômants.\n"]
["P10",null,"Intitulé des parcours diplômant"]
["P11",null,"Éléments différenciants de la formation",null,null,"Préciser les particularités de la formation (mention ou parcours diplômants) devant être prises en considération pour la compréhension de l'analyse des données de la formation (ex. parcours diplômant exclusivement réservé aux étudiants internationaux, aux publics de la formation continue, exclusivement ou partiellement ouvert à l'alternance, proposé entièrement à distance, etc.)."]
[]
{"$rows_left_out":887}
{"sheet":"2. Données de caractérisation","index":2,"n_rows":24,"n_cols":9,"rows_kept":24,"cut":false,"hidden":false,"merged":[[9,1,9,2],[6,5,6,9],[0,1,3,5],[7,1,7,2],[5,1,5,5]]}
[null,"DÉPARTEMENT D’ÉVALUATION DES FORMATIONS"]
[]
[]
[]
[]
[null,{"$f":"'1. Présentation'!D11","v":0}]
[]
[null,"2. Données de caractérisation de la formation"]
[]
[null,"Données de caractérisation",null,"Année 2019-2020","Année 2020-2021","Année 2021-2022","Précisions sur la définition et/ou le mode de calcul de la donnée (en particulier, lorsque les éléments présents dans le SI de l'établissement ne correspondent pas aux éléments indiqués par le Hcéres)"]
["IG1","DC 1","Nombre total d’inscrits administratifs dans la formation* (dans tout le cycle)",null,null,null,null,null,"IG1"]
[null,"DC 2","dont étudiants internationaux*"]
[null,"DC 3","dont étudiants ayant des besoins spécifiques et bénéficiant d'un aménagement d'études"]
["IG1","DC 4","Nombre total d’hommes inscrits dans la formation (inscrits administratifs dans tout le cycle)",null,null,null,null,null,"IG1"]
["IG1","DC 5","Nombre total de femmes inscrites dans la formation (inscrits administratifs dans tout le cycle)",null,null,null,null,null,"IG1"]
[null,"DC 6a","Nombre total d’inscrits administratifs en 1re année du cycle* "]
[null,"DC 6b","Nombre total d’inscrits administratifs en 2e année du cycle*"]
[null,"DC 6c","Nombre total d’inscrits en 3e année du cycle* (DFA en sciences médicales)"]
[null,"DC 7","Nombre de diplômés de l'année*"]
[null,"DC 8","Capacité d'accueil des néo-entrants dans la 1re année du cycle*"]
{"$rows_left_out":5}
{"sheet":"3. Données et analyse","index":3,"n_rows":111,"n_cols":13,"rows_kept":111,"cut":false,"hidden":false,"merged":[[45,1,72,1],[56,2,62,2],[65,2,70,2],[10,12,11,12],[10,5,11,5],[10,11,11,11],[10,4,11,4],[12,1,44,1],[20,2,22,2],[23,2,24,2],[71,2,72,2],[26,2,27,2],[28,2,30,2],[35,2,36,2],[37,2,38,2],[28,10,30,10],[96,1,110,1],[97,2,98,2],[99,2,100,2],[109,2,110,2],[73,1,95,1],[75,2,76,2],[102,2,105,2],[78,2,82,2],[84,2,95,2],[1,3,4,9],[10,7,10,9],[0,1,3,2],[5,1,5,2],[7,1,7,2],[10,2,11,2],[10,6,11,6],[10,3,11,3],[8,1,8,4],[48,2,50,2],[35,10,36,10],[37,10,38,10],[40,10,44,10],[46,10,47,10],[48,10,50,10],[40,2,44,2],[46,2,47,2],[5,10,8,10],[5,11,8,11],[109,10,110,10],[84,10,95,10],[97,10,98,10],[99,10,100,10],[101,10,102,10],[103,10,105,10],[56,10,62,10],[65,10,70,10],[71,10,72,10],[75,10,76,10],[78,10,82,10],[23,10,24,10],[20,10,22,10],[26,10,27,10]]}
[null,"DÉPARTEMENT D’ÉVALUATION DES FORMATIONS"]
[]
[]
[]
[]
[null,{"$f":"'1. Présentation'!D11","v":0},null,null,null,null,null,null,null,null,"*Pour une définition des niveaux de la grille d'auto-positionnement, voir le tableau à droite","*Prise en compte des recommandations du Hcéres ; explication des résultats, des freins et des leviers ; explication des évolutions passées ou à venir ; mesures correctives proposées"]
[]
[null,"3. Données et analyse"]
[null,"Cet onglet permet de présenter l’autoévaluation de la formation, en s’appuyant sur une analyse de l’équipe pédagogique étayée par des données qualitatives, des données quantitatives et un auto-positionnement. \nPour chacune des données quantitatives ci-dessous, indiquer une valeur caractérisant la formation pour chacune des années de référence. \nSi la donnée est invariante dans la période de référence, indiquer la valeur correspondant à la colonne 2021-2022."]
[]
[null,null,"Référentiel Hcéres - formations du 2e cycle","Code de la donnée","Repères pour les données qualitatives\n","Données qualitatives (500 caractères maximum)","Données quantitatives","Valeur pour chaque année de la période de référence",null,null,null,"Analyse obligatoire de l'auto-positionnement et des données qualitatives et quantitatives *\n\n(1 000 caractères maximum)","Précisions sur la définition et/ou le mode de calcul de la donnée (en particulier, lorsque les éléments présents dans le SI de l'établissement ne correspondent pas aux éléments indiqués par le Hcéres)"]
[null,null,null,null,null,null,null,"Année 2019-2020","Année 2020-2021","Année 2021-2022","Auto-positionnement\n\nNiveau atteint : 1, 2, 3, 4, 5 *"]
[null,"Domaine 1 : La politique et la caractérisation de la formation","Référence 1 : La formation est en adéquation avec la stratégie de formation de l’établissement."]
[null,null,"C1. La formation s’inscrit dans les ambitions, dans les orientations pédagogiques et dans les priorités thématiques de l’établissement.","Document 1","Critère évalué sur la base du document n°1 ayant valeur de preuve "]
[null,null,"C2. La formation est construite en cohérence et en complémentarité avec les autres formations du même cycle et en articulation avec celles des autres cycles avec lesquelles elle s’inscrit en continuum.","Document 1","Critère évalué sur la base du document n°1 ayant valeur de preuve "]
[null,null,"C3. La formation s’assure de la réalité et de la valeur ajoutée de ses partenariats académiques locaux, régionaux et nationaux.","DQL 1-3","Principaux éléments de collaboration dans le cadre de parcours construits en partenariat (existence d'une équipe pédagogique commune, d'enseignements communs, de modalités de pilotage commun de la formation)"]
[null,null,"C4. La formation intègre l’apport de la pluridisciplinarité et de l’interdisciplinarité dans sa finalité et dans son contenu.","DQL 1-4","Principales actions menées en faveur de la pluridiscplinarité et/ou de l'interdisciplinarité dans la formation (disciplines concernées, dispositifs, exemples d'enseignements ou de projets, etc.)"]
[null,null,"C5. La formation intègre les enjeux du développement durable.","DQL 1-5","Compétences visées par la formation, modalités de formation (enseignements disciplinaires ou transversaux dédiés, projets, etc.)"]
[null,null,"C6. La formation s’appuie sur les actions menées et sur les moyens obtenus dans le cadre des projets du Programme d'investissements d'avenir (PIA), pour dynamiser son contenu et ses dispositifs.","DQL-1-6","Dispositifs  financés par les projets du PIA (parcours, heures d'enseignement, innovation pédagogique, écoles d'été, etc.)"]
[null,null,"Référence 2 : La formation est ouverte à l’international en cohérence avec les priorités définies par l’établissement."]
{"$rows_left_out":92}
{"sheet":"Data des listes","index":4,"n_rows":50,"n_cols":2,"rows_kept":50,"cut":false,"hidden":true,"merged":[]}
["Référence 1 : La formation est en adéquation avec la stratégie de formation de l’établissement.","Choix d'auto-positionnement"]
["C1. La formation s’inscrit dans les ambitions, les orientations pédagogiques et les priorités thématiques de l’établissement.",1]
["C2. La formation est construite en cohérence et complémentarité avec les autres formations du même cycle et en articulation avec celles des autres cycles avec lesquelles elle s’inscrit en continuum.",2]
["C3. La formation s’assure de la réalité et de la valeur ajoutée de ses partenariats académiques locaux, régionaux et nationaux.",3]
["C4. La formation intègre l’apport de la pluridisciplinarité et de l’interdisciplinarité dans sa finalité et dans son contenu.",4]
["C5. La formation intègre les enjeux du développement durable.",5]
["C6. La formation s’appuie sur les actions menées et sur les moyens obtenus dans le cadre des projets du Programme d'investissements d'avenir (PIA), pour dynamiser son contenu et ses dispositifs."]
["Référence 2 : La formation est ouverte à l’international en cohérence avec les priorités définies par l’établissement."]
["C1. La formation développe une offre spécifique à l'international en s’assurant de la réalité et de la valeur ajoutée de ses partenariats internationaux."]
["C2. La formation inclut des mobilités entrantes et sortantes des étudiants, et bénéficie, à cet effet, d'un soutien y compris financier."]
["Référence 3 : La formation bénéficie d’un adossement à la recherche."]
["C1. La formation intègre une formation à et par la recherche adaptée à sa finalité. "]
["C2. Des enseignants-chercheurs et chercheurs des disciplines de la formation participent aux enseignements."]
["C3. La formation et les unités de recherche auxquelles elle est adossée mettent en place, à l'intention des étudiants, un dispositif d’accueil, d’accompagnement et de formation par la recherche des étudiants."]
["C4. La formation inclut une formation à l’intégrité scientifique et à la déontologie."]
["C5. La formation à et par la recherche au sein de la formation s’appuie sur les services de documentation, en matière de contribution de leurs personnels aux contenus de formation, d’acquisition de ressources, d’accès des étudiants à celles-ci."]
["Référence 4 : La formation entretient des relations avec le monde social, économique et culturel, et intègre des éléments de professionnalisation."]
["C1. La formation prend en compte les besoins sociaux, économiques et culturels du territoire pour définir ses débouchés, sa finalité et ses contenus, en cohérence avec sa fiche RNCP. Elle associe les acteurs sociaux, économiques et culturels à cette démarche et valorise auprès d'eux les compétences auxquelles elle forme."]
["C2. La formation associe les acteurs sociaux, économiques et culturels à ses activités pédagogiques"]
["C3. La formation définit sa politique en matière d’alternance et de formation continue en lien avec le positionnement et la stratégie de l’établissement."]
{"$rows_left_out":31}
{"sheet":"Nomenclature","index":5,"n_rows":356,"n_cols":26,"rows_kept":356,"cut":false,"hidden":true,"merged":[]}
["Établissements","Codes UAI",null,"Université Sorbonne Paris Nord","Université Sorbonne Nouvelle - Paris 3","Université Paris Sciences et Lettres","Université Paris 1 Panthéon-Sorbonne","Université Pantheon-Assas Paris II","Université de Paris","Sorbonne Université","Muséum national d'Histoire naturelle","Institut national des langues et civilisations orientales","École des hautes études en sciences sociales","Conservatoire national des arts et métiers","Arts et metiers Paristech - École nationale supérieure des arts et métiers",null,null,null,null,"Libellé établissement","Intitulé indiqué dans l'arrêté d'accréditation","Code UAI Etablissement","Type de formation indiqué dans l'arrêté d'accréditation","Numéro d'accréditation de la mention","Domaine indiqué dans l'arrêté d'accréditation","Composante de rattachement"]
["Université Sorbonne Paris Nord","0931238R",32,"Analyse et politique économiques","Cinéma et audiovisuel","Analyse et politique économiques","Analyse et politique économiques","Approches Interdisciplinaires de la Recherche et de l'Enseignement (AIRE)","Administration économique et sociale","Actuariat","Biodiversité, écologie et évolution","Langues et sociétés","Analyse et politique économiques","Actuariat","Energie",null,null,null,null,"Université Sorbonne Paris Nord","Analyse et politique économiques","0931238R","Master",20151074,"Droit, Economie, Gestion","UFR de Sciences économiques et de Gestion"]
["Université Sorbonne Nouvelle","0751719L",16,"Arts, lettres et civilisations","Didactique des langues","Archives","Droit","Bio-informatique","Administration et liquidation d'entreprises en difficulté","Analyse et politique économique",1,"Langues, littératures et civilisations étrangères et régionales","Anthropologie","Audiovisuel, médias interactifs numériques, jeux","Génie industriel",null,null,null,null,"Université Sorbonne Paris Nord","Arts, lettres et civilisations","0931238R","Master",20190311,"Arts, Lettres, Langues","UFR de Lettres, Langues, Sciences Humaines et des Sociétés"]
["Université Paris Sciences et Lettres","0756036D",43,"Biologie-santé","Direction de projets ou établissements culturels","Civilisations, cultures et sociétés","Droit comparé","Biologie intégrative et physiologie","Analyse et politique économiques","Automatique, robotique",null,"Management et commerce international","Arts, littératures, langages","Comptabilité - contrôle - audit","Génie mécanique",null,null,null,null,"Université Sorbonne Paris Nord","Biologie-santé","0931238R","Master",20042186,"Sciences, Technologies, Santé","UFR de Santé, Médecine, et Biologie Humaine"]
["Université Paris-Panthéon-Assas","0756305W",36,"Communication des organisations","Etudes européennes et internationales","Comptabilité - contrôle - audit","Droit de la propriété intellectuelle","Biologie moléculaire et cellulaire","Archéologie, sciences pour l'archéologie","Biodiversité, écologie et évolution",null,"Relations internationales","Economie appliquée","Contrôle de gestion et audit organisationnel",3,null,null,null,null,"Université Sorbonne Paris Nord","Communication des organisations","0931238R","Master",20151088,"Culture et communication","UFR des Sciences de la Communication"]
["Université Paris Cité","0755976N",67,"Comptabilité - contrôle - audit","Humanités numériques","Droit","Droit de l'immobilier","Chimie","Arts plastiques","Biologie intégrative et physiologie",null,"Traduction et interprétation","Etudes asiatiques","CRIMINOLOGIE",null,null,null,null,null,"Université Sorbonne Paris Nord","Comptabilité - contrôle - audit","0931238R","Master",20141707,"Droit, Economie, Gestion","UFR de Sciences économiques et de Gestion"]
["Université Paris 1 Panthéon-Sorbonne","0751717J",66,"Contrôle de gestion et audit organisationnel","Industries culturelles","Economie appliquée","Droit des affaires","Cinéma et audiovisuel","Cinéma et audiovisuel","Biologie moléculaire et cellulaire",null,5,"Etudes politiques","Design",null,null,null,null,null,"Université Sorbonne Paris Nord","Contrôle de gestion et audit organisationnel","0931238R","Master",20141470,"Droit, Economie, Gestion","UFR de Sciences économiques et de Gestion"]
["Sorbonne Université","0755890V",33,"Création numérique","Information, communication","Economie et gestion de la santé","Droit des affaires franco-asiatiques","Comptabilité - contrôle - audit","Comptabilité - contrôle - audit","Chimie",null,null,"Etudes sur le genre","Droit de l'entreprise",null,null,null,null,null,"Université Sorbonne Paris Nord","Création numérique","0931238R","Master",20151086,"Culture et communication","UFR des Sciences de la Communication"]
["Muséum national d'Histoire naturelle","0753494R",1,"Droit","Journalisme","Energie","Droit des assurances","Contrôle de gestion et audit organisationnel","Conservation-restauration des biens culturels","Electronique, énergie électrique, automatique",null,null,"Histoire","Droit de l'immobilier",null,null,null,null,null,"Université Sorbonne Paris Nord","Droit","0931238R","Master",20042187,"Droit, Economie, Gestion","UFR de Droit, Sciences Politiques et Sociales"]
["Institut national des langues et civilisations orientales","0753488J",5,"Economie de l'entreprise et des marchés","Langues étrangères appliquées","Etudes asiatiques","Droit des collectivités territoriales","Création artistique","Contrôle de gestion et audit organisationnel","Géographie, aménagement, environnement et développement",null,null,"Migrations","Economie",null,null,null,null,null,"Université Sorbonne Paris Nord","Economie de l'entreprise et des marchés","0931238R","Master",20140842,"Droit, Economie, Gestion","UFR de Sciences économiques et de Gestion"]
["École des hautes études en sciences sociales","0753742K",17,"Ethologie","Langues, littératures et civilisations étrangères et régionales","Histoire de l'art et archéologie","Droit du numérique","Didactique des sciences","Démographie","Histoire",null,null,"Philosophie","Electronique, énergie électrique, automatique",null,null,null,null,null,"Université Sorbonne Paris Nord","Ethologie","0931238R","Master",20042211,"Sciences, Technologies, Santé","UFR de Lettres, Langues, Sciences Humaines et des Sociétés"]
["Conservatoire national des arts et métiers","0753471R",35,"Génie des procédés et des bio-procédés","Lettres","Humanités","Droit du patrimoine","Droit bancaire et financier","Design","Histoire de l'art et archéologie",null,null,"Recherches comparatives en anthropologie, histoire, sociologie","Entrepreneuriat et management de projets",null,null,null,null,null,"Université Sorbonne Paris Nord","Génie des procédés et des bio-procédés","0931238R","Master",20042152,"Sciences, Technologies, Santé","Institut Galilée"]
["Arts et metiers Paristech - École nationale supérieure des arts et métiers","0753237L",3,"Géographie","Littérature générale et comparée","Humanités numériques","Droit européen","Droit comparé","Direction de projets ou établissements culturels","Information, communication",null,null,"Savoirs en sociétés","Ergonomie",null,null,null,null,null,"Université Sorbonne Paris Nord","Géographie","0931238R","Master",20190313,"Sciences Humaines et Sociales","UFR de Lettres, Langues, Sciences Humaines et des Sociétés"]
[null,null,0,"Histoire","Sciences du langage","Informatique","Droit international","Droit de la santé","Droit bancaire et financier","Informatique",null,null,"Sciences des religions et sociétés","Finance",null,null,null,null,null,"Université Sorbonne Paris Nord","Histoire","0931238R","Master",20190314,"Sciences Humaines et Sociales","UFR de Lettres, Langues, Sciences Humaines et des Sociétés"]
[null,null,null,"Industries culturelles","Sciences sociales, coopération et développement en Amérique Latine/Latin American Studies","Management de l'innovation","Droit notarial","Droit des affaires","Droit comparé","Langues étrangères appliquées",null,null,"Sciences économiques et sociales","Génie des procédés et des bio-procédés",null,null,null,null,null,"Université Sorbonne Paris Nord","Industries culturelles","0931238R","Master",20190320,"Culture et communication","UFR des Sciences de la Communication"]
[null,null,null,"Informatique","Théâtre","Mathématiques et applications","Droit pénal et sciences criminelles","Droit du numérique","Droit de la propriété intellectuelle","Langues, littératures et civilisations étrangères et régionales",null,null,"Sciences sociales","Géographie, aménagement, environnement et développement",null,null,null,null,null,"Université Sorbonne Paris Nord","Informatique","0931238R","Master",20042147,"Sciences, Technologies, Santé","Institut Galilée"]
[null,null,null,"Ingénierie et innovation en images et réseaux","Traduction et interprétation","Philosophie","Droit privé","Droit international","Droit de la santé","Lettres",null,null,"Sociologie","Gestion de l'environnement",null,null,null,null,null,"Université Sorbonne Paris Nord","Ingénierie et innovation en images et réseaux","0931238R","Master",20042149,"Sciences, Technologies, Santé","Institut Galilée"]
[null,null,null,"Langues, littératures et civilisations étrangères et régionales",16,"Physique","Droit public","Droit notarial","Droit de l'entreprise","Management de l'innovation",null,null,"Territoires et développement","Gestion des ressources humaines",null,null,null,null,null,"Université Sorbonne Paris Nord","Langues, littératures et civilisations étrangères et régionales","0931238R","Master",20190312,"Arts, Lettres, Langues","UFR de Lettres, Langues, Sciences Humaines et des Sociétés"]
[null,null,null,"Mathématiques",null,"Politiques publiques","Droits de l'homme et Justice internationale","Droit privé","Droit de l'environnement et de l'urbanisme","Mathématiques et applications",null,null,17,"Humanités numériques",null,null,null,null,null,"Université Sorbonne Paris Nord","Mathématiques","0931238R","Master",20190315,"Sciences, Technologies, Santé","Institut Galilée"]
[null,null,null,"Métiers du livre et de l'édition",null,"Sciences cognitives","Droit social","Droit public","Droit des affaires","Mécanique",null,null,null,"Information, communication",null,null,null,null,null,"Université Sorbonne Paris Nord","Métiers du livre et de l'édition","0931238R","Master",20151087,"Culture et communication","UFR des Sciences de la Communication"]
{"$rows_left_out":337}
{"sheet":"Dev","index":6,"n_rows":0,"n_cols":0,"rows_kept":0,"cut":false,"hidden":true,"merged":[]}